{"text_format":"1","workbook":"xlsx","n_sheets":2,"sheets":["Kuntakortti","Luvut"],"not_rendered":{"charts":0,"images":0,"macros":1,"external_links":0,"defined_names":2,"comments":0,"pivot_tables":0},"unopened":[],"bounds":{"document_bytes":16777216,"sheet_cells":100000,"rows_first":2000,"rows_last":500,"rows_between":2000,"halvings":0,"cell_chars":16384,"cell_head_chars":4096},"cells_cut":0,"cells_raw":0,"read":"whole","date_system":"1900"}

{"sheet":"Kuntakortti","index":0,"n_rows":78,"n_cols":15,"rows_kept":78,"cut":false,"hidden":false,"merged":[[10,30,10,31]]}
["Valtiovarainministeriö/Kunta- ja aluehallinto-osasto,12.2.2015",null,null,null,null,null,null,"Valitse kunta "]
["KUNTIEN TALOUSARVIOT 2014-2015 JA TALOUSSUUNNITELMAT 2016-2017",null,null,null,null,null,null,"valikosta:"]
[null,null,null,null,null,null,null," "]
[{"$f":"INDEX(Luvut!$B$3:'Luvut'!$B$304,$A$7)","v":"KOKO MAA (Manner-Suomi)"},null,null,2014,null,null,2015,null,null,2016,null,null,2017]
[]
["Asukasluku",null,null,{"$f":"VLOOKUP($A$4,Luvut!$B$3:$AU$304,2)","v":5422604},null,null,{"$f":"VLOOKUP($A$4,Luvut!$B$3:$EG$304,47)","v":5422604}," ",{"$f":"((G6/D6)-1)*100","v":0},{"$f":"VLOOKUP($A$4,Luvut!$B$3:$EG$304,92)","v":5422604}," ",{"$f":"((J6/G6)-1)*100","v":0},{"$f":"VLOOKUP($A$4,Luvut!$B$3:$HG$304,137)","v":5422604},null,{"$f":"((M6/J6)-1)*100","v":0}]
[99,null,null," "]
[]
[]
[]
[]
[]
[]
[]
[]
{"$rows_left_out":64}
{"sheet":"Luvut","index":1,"n_rows":304,"n_cols":234,"rows_kept":304,"cut":false,"hidden":false,"merged":[]}
[null,1,2,"hakee muualta",92,93,94,"vanha",96,97,98,99,100,101,14,15,16,17,18,19,null,"summana",null,null,24,25,null,null,null,null,null,null,null,null,null,"kaavasta",null,null,null,null,null,null,null,43,44,"kaavasta",null,47,"hakee muualta",null,null,null,"vanha",null,null,null,null,null,null,59,60,61,62,63,64,null,"summana",null,null,69,70,null,null,null,null,null,null,null,null,null,null,null,null,null,null,null,null,null,88,"kaavasta",133,91,92,"hakee muualta",92,93,94,"vanha",96,97,98,99,100,101,104,105,106,107,108,109,null,"summana",null,null,114,115,null,null,null,null,null,null,null,null,null,"kaavasta",null,null,null,null,null,null,null,133,134,"kaavasta",133,137,null,null,140,null,null,null,null,null,null,null,null,149,150,151,152,153,154,null,null,null,null,159,169,null,null,null,null,null,null,null,null,null,null,null,null,null,null,null,null,null,178,179,null,181,182,183,184,null,null,null,188,189,190,191,192,193,194,195,196,197,198,199,2011,152,2012,154,2013,null,206,null,null,null,210,null,null,null,214,null,null,null,218]
["Kunta nro","Kunta","Asukasluku 2014","Lainat e/asukas","Lainanhoitokate","Suhteellinen velkaantuneisuus-%","Rahoitusvarallisuus, e/as","Vuosikate","Suunnitelman mukaiset poistot","Tilikauden tulos","Omavaraisuusaste, %","Rahavarat e/as","Kassan riittävyys, pv","Kassasta maksut, €/as","Henkilöstökulut","Toimintatuotot","Toimintakulut","Toimintakate","Verotulot","Valtionosuudet","Alv-takaisinperintä","Käyttökate","Korkotuotot/-menot, netto","Muut rahoitustuotot/-menot, netto (sis Osinkotuotot)","Vuosikate","Sumu-poistot ja arvonalet","Satunnaiset tuotot","Satunnaiset kulut","Tilikauden tulos","Poistoeron lisäys(-) tai vähennys(+)","Varausten lisäys(-) tai vähennys(+)","Rahastojen lisäys(-) tai vähennys(+)","Tilikauden yli- tai alijäämä","Kumulat yli/alij","Tulorah (toiminnan rahavirta)","Investoinnit, netto","Saamisten muutos (ent Pitkäaikaisten saamisten muutokset, netto)","Pitkäaikaisten lainojen vähennys","Toim ja inv rahavirta","Verotulot","Kunnallisvero","Osuus yhteisöveron tuotosta","Kiinteistövero","Tuloveroprosentti","Henkilöstömäärä","Yhden veroprosentin tuotto 2006","Sijoitus vuosikatteen mukaan","Asukasluku 2015","Lainat e/asukas","Lainanhoitokate","Suhteellinen velkaantuneisuus-%","Rahoitusvarallisuus, e/as","Vuosikate","Suunnitelman mukaiset poistot","Tilikauden tulos","Omavaraisuusaste, %","Rahavarat e/as","Kassan riittävyys, pv","Kassasta maksut, €/as","Henkilöstökulut","Toimintatuotot","Toimintakulut","Toimintakate","Verotulot","Valtionosuudet","Alv-takaisinperintä","Käyttökate","Korkotuotot/-menot, netto","Muut rahoitustuotot/-menot, netto (sis Osinkotuotot)","Vuosikate","Sumu-poistot ja arvonalet","Satu. tuotot","Satu. kulut","Tilikauden tulos","Poistoeron lisäys(-) tai vähennys(+)","Varausten lisäys(-) tai vähennys(+)","Rahastojen lisäys(-) tai vähennys(+)","Tilikauden yli- tai alijäämä","Kumulat yli/alij","Tulorah (toiminnan rahavirta)","Investoinnit, netto","Saamisten muutos (ent Pitkäaikaisten saamisten muutokset, netto)","Pitkäaikaisten lainojen vähennys","Toim ja inv rahavirta","Verotulot","Kunnallisvero","Osuus yhteisöveron tuotosta","Kiinteistövero","Tuloveroprosentti","Yhden veroprosentin tuotto 2006","Sijoitus vuosikatteen mukaan","Henkilöstömäärä","Asukasluku 2016","Lainat e/asukas","Lainanhoitokate","Suhteellinen velkaantuneisuus-%","Rahoitusvarallisuus, e/as","Vuosikate","Suunnitelman mukaiset poistot","Tilikauden tulos","Omavaraisuusaste, %","Rahavarat e/as","Kassan riittävyys, pv","Kassasta maksut, €/as","Henkilöstökulut","Toimintatuotot","Toimintakulut","Toimintakate","Verotulot","Valtionosuudet","Alv-takaisinperintä","Käyttökate","Korkotuotot/-menot, netto","Muut rahoitustuotot/-menot, netto (sis Osinkotuotot)","Vuosikate","Sumu-poistot ja arvonalet","Satu. tuotot","Satu. kulut","Tilikauden tulos","Poistoeron lisäys(-) tai vähennys(+)","Varausten lisäys(-) tai vähennys(+)","Rahastojen lisäys(-) tai vähennys(+)","Tilikauden yli- tai alijäämä","Kumulat yli/alij","Tulorah (toiminnan rahavirta)","Investoinnit, netto","Saamisten muutos (ent Pitkäaikaisten saamisten muutokset, netto)","Pitkäaikaisten lainojen vähennys","Toim ja inv rahavirta","Verotulot","Kunnallisvero","Osuus yhteisöveron tuotosta","Kiinteistövero","Tuloveroprosentti","Henkilöstömäärä","Yhden veroprosentin tuotto 2006","Sijoitus vuosikatteen mukaan","Asukasluku 2017","Lainat e/asukas","Lainanhoitokate","Suhteellinen velkaantuneisuus-%","Rahoitusvarallisuus, e/as","Vuosikate","Suunnitelman mukaiset poistot","Tilikauden tulos","Omavaraisuusaste, %","Rahavarat e/as","Kassan riittävyys, pv","Kassasta maksut, €/as","Henkilöstökulut","Toimintatuotot","Toimintakulut","Toimintakate","Verotulot","Valtionosuudet","Alv-takaisinperintä","Käyttökate","Korkotuotot/-menot, netto","Muut rahoitustuotot/-menot, netto (sis Osinkotuotot)","Vuosikate","Sumu-poistot ja arvonalet.","Satu. tuotot","Satu. kulut","Tilikauden tulos","Poistoeron lisäys(-) tai vähennys(+)","Varausten lisäys(-) tai vähennys(+)","Rahastojen lisäys(-) tai vähennys(+)","Tilikauden yli- tai alijäämä","Kumulat yli/alij","Tulorah (toiminnan rahavirta)","Investoinnit, netto","Saamisten muutos (ent Pitkäaikaisten saamisten muutokset, netto)","Pitkäaikaisten lainojen vähennys","Toim ja inv rahavirta","Verotulot","Kunnallisvero","Osuus yhteisöveron tuotosta","Kiinteistövero","Tuloveroprosentti","Henkilöstömäärä","Sijoitus vuosikatteen mukaan","Palvelujen ostot 2014","Palvelujen ostot 2015","Palvelujen ostot 2016","Palvelujen ostot 2017","Harkvar2011","Harkvar2012","Harkvar2013","Investointimenot 2014","Rahoitusos. inv.menoihin","Inv.hyödykk. luovutustulot","Investointimenot 2015"," Rahoitusos. inv.menoihin","Inv.hyödykkeiden luovutustulot","Investointimenot 2016","Rahoitusosuudet investointimenoihin","Investointihyödykkeiden luovutustulot","Investointimenot 2017"," Rahoitusos. inv.menoihin"," Inv.hyödykkeiden luovutustulot","Pitkäaikaisten lainojen lisäys"," ± Lyhytaikaisten lainojen muutos","Pitkäaikaisten lainojen lisäys"," ± Lyhytaikaisten lainojen muutos","Pitkäaikaisten lainojen lisäys"," ± Lyhytaikaisten lainojen muutos","Lainakanta 2014","josta pitkäaik","josta lyhytaik","Lainasaamiset","Lainakanta 2015","josta pitkäaik","josta lyhytaik","Lainasaamiset","Lainakanta 2016","josta pitkäaik","josta lyhytaik","Lainasaamiset","Lainakanta 2017"]
[20,"Akaa",17108,null,0.7588319379211762,44.9,-1980,null,null,null,43.5,212,12,6059.0954303434555,49387,23309,111171,-87862,57850,30502,null,null,null,null,280,3862,null,null,null,null,null,null,null,null,null,null,null,null,null,null,null,null,null,21,1029,null,199,{"$f":"C3","v":17108},null,-0.41593369418132614,51.9,-2485,null,null,null,37.799999999999997,158,8,7406.1515116143346,48260,23726,110229,-86503,58700,29700,null,null,null,null,1631,4481,null,null,null,null,null,null,null,null,null,null,null,null,null,null,null,null,null,"21,25",null,307,990,{"$f":"AV3","v":17108},null,0.60431763285024154,48.72661510503999,-2688.0991349076457,null,null,null,37.011654906557858,98.550385784428329,4.9360722535934292,7287.350946925415,48000,23421,109277,-85856,62560,29920,null,null,null,null,6293,4556,null,null,null,null,null,null,null,null,null,null,null,null,null,null,null,null,null,"22,25",989,null,205,{"$f":"CO3","v":17108},null,null,null,null,null,null,null,null,null,null,null,47872,23432,108972,-85540,64665,30430,null,null,null,null,9220,4831,null,null,null,null,null,null,null,null,null,null,null,null,null,null,null,null,null,"22,25",986,null,45958,46155,45777,45731,null,null,1540,-14813,1204,680,-7824,641,680,-6246,808,680,-9555,555,680,7000,null,10204,null,7509,null,52206,28998,5033,42,57403,null,null,null,56194,34511,6387,7333,55621,null,null,null,null,null,null,null,null,null,null,null,null,null,4670,{"$f":"HY3*-1","v":-4670}]
[5,"Alajärvi",10227,null,1.0397684369494085,29.1,-2055,null,null,null,47.2,316,11,10581.969594267453,43152,41240,99883,-58643,28139,33318,null,null,null,null,2436,3125,null,null,null,null,null,null,null,null,null,null,null,null,null,null,null,null,null,21,988,null,120,{"$f":"C4","v":10227},null,0.26483613817537643,33.5,-2443,null,null,null,42,321,11,10728.184651343981,42506,41868,100217,-58349,29162,33873,null,null,null,null,4329,2989,null,null,null,null,null,null,null,null,null,null,null,null,null,null,null,null,null,"21,5",null,219,953,{"$f":"AV4","v":10227},null,0.15189873417721519,38.195341250036414,-3121.3454581011047,null,null,null,35.748268496342803,360.5162804341449,11.659331329111181,11286.105407255303,42241,42496,100750,-58254,29375,33873,null,null,null,null,4407,3128,null,null,null,null,null,null,null,null,null,null,null,null,null,null,null,null,null,22,930,null,268,{"$f":"CO4","v":10227},null,null,null,null,null,null,null,null,null,null,null,42452,43133,101771,-58638,29893,33873,null,null,null,null,4516,3068,null,null,null,null,null,null,null,null,null,null,null,null,null,null,null,null,null,22,928,null,48384,49241,49980,50729,null,null,null,-2866,253,null,-3283,200,null,-6473,480,null,-2215,null,null,2500,null,6000,null,9000,1500,27855,13515,4517,1162,26516,null,null,null,27905,20854,7148,566,25738,null,null,null,null,null,null,null,null,null,null,null,null,null,3040,-3040]
[9,"Alavieska",2740,null,0.7041906327033689,56.7,-2821,null,null,null,37,403,22,8734.181818181818,3549,2344,17535,-15191,7383,7913,null,null,null,null,22,720,null,null,null,null,null,null,null,null,null,null,null,null,null,null,null,null,null,"21,5",64,null,229,2740,null,5.185979971387697E-2,59.4,-3134,null,null,null,34,147,7,7455.6320173850054,3623,2401,17251,-14850,7293,8500,null,null,null,null,836,835,null,null,null,null,null,null,null,null,null,null,null,null,null,null,null,null,null,"21,5",null,234,65,2740,null,0.18723926380368097,76.880301072852888,-4426.2773722627735,null,null,null,27.354709418837675,302.91970802919712,11.589074633717148,9540.5109489051101,3678,2437,17510,-15073,7397,8644,null,null,null,null,856,860,null,null,null,null,null,null,null,null,null,null,null,null,null,null,null,null,null,"21,5",64,null,176,2740,null,null,null,null,null,null,null,null,null,null,null,3740,2478,17808,-15330,7634,8822,null,null,null,null,1010,890,null,null,null,null,null,null,null,null,null,null,null,null,null,null,null,null,null,"21,5",63,null,12934,12429,12615,12830,300,null,360,-911,19,20,-963,108,20,-636,null,20,-455,null,20,1393,-1000,null,3700,3900,4000,12457,5127,2469,798,12337,null,null,null,12568,6976,5581,84,11968,null,null,null,null,null,null,null,null,null,null,null,null,null,792,-792]
[10,"Alavus",12228,null,0.79253112033195017,42.6,-1469,null,null,null,54.9,1040,52,6691.1908115722181,34240,22022,89786,-67764,33181,37657,null,null,null,null,3193,2880,null,null,null,null,null,null,null,null,null,null,null,null,null,null,null,null,null,"20,75",950,null,182,12228,null,0.55079365079365084,45.2,-1664,null,null,null,52.3,1116,54,7495.6078516429889,34120,21873,88966,-67093,33402,36891,null,null,null,null,3567,2942,null,null,null,null,null,null,null,null,null,null,null,null,null,null,null,null,null,"20,75",null,150,950,12228,null,0.64445418676019295,50.300563703131942,-2319.103696434413,null,null,null,49.829049005951624,894.7497546614328,42.550211500964274,7675.2535165194631,34320,22157,90123,-67966,33946,36891,null,null,null,null,3216,2690,null,null,null,null,null,null,null,null,null,null,null,null,null,null,null,null,null,"20,75",950,null,192,12228,null,null,null,null,null,null,null,null,null,null,null,34520,22442,91279,-68837,34864,36891,null,null,null,null,3253,2869,null,null,null,null,null,null,null,null,null,null,null,null,null,null,null,null,null,"20,75",950,null,42609,42102,42802,43520,null,null,null,-4680,422,340,-5817,380,380,-5220,215,null,-3690,165,null,3000,1298,5000,-298,10900,-3500,30552,14563,4130,1433,31778,null,null,null,33338,26545,4676,3962,33512,null,null,null,null,null,null,null,null,null,null,null,null,null,2706,-2706]
[16,"Asikkala",8405,null,3.6733333333333333,47.2,-2410,null,null,null,52.1,38,2,6265.3565544834082,12932,6837,51845,-45008,29205,17004,null,null,null,null,1117,2000,null,null,null,null,null,null,null,null,null,null,null,null,null,null,null,null,null,"20,75",295,null,138,8405,null,2.2929642445213378,50.3,-2756,null,null,null,49.3,35,2,6547.5712090769412,13100,5900,49815,-43915,29365,16450,null,null,null,null,1740,1800,null,null,null,null,null,null,null,null,null,null,null,null,null,null,null,null,null,"20,75",null,112,290,8405,null,0.41480515245393773,44.415927678075498,-2539.6787626412852,null,null,null,51.530283170006037,40.57108863771564,1.8994170430960811,7796.3117192147529,13300,6000,50300,-44300,29942,16100,null,null,null,null,1542,1800,null,null,null,null,null,null,null,null,null,null,null,null,null,null,null,null,null,"20,75",290,null,159,8405,null,null,null,null,null,null,null,null,null,null,null,13500,6100,51296,-45196,30713,16100,null,null,null,null,1377,1800,null,null,null,null,null,null,null,null,null,null,null,null,null,null,null,null,null,"20,75",285,null,35148,33700,34000,34500,null,null,null,-8780,1115,0,-2335,45,null,-2220,null,null,-1800,null,null,6950,2200,450,1500,600,2400,14000,6437,10195,9211,13000,null,null,null,13000,1574,13530,887,13000,null,null,null,null,null,null,null,null,null,null,null,null,null,380,-380]
[18,"Askola",4991,null,-0.82442748091603058,63.7,-2853,null,null,null,32.299999999999997,172,11,8208.9187538179594,12846,4091,28190,-24099,17854,6798,null,null,null,null,493,965,null,null,null,null,null,null,null,null,null,null,null,null,null,null,null,null,null,"20,25",296,null,314,4991,null,0.94182124789207422,57.2,-2703,null,null,null,31.1,203,13,5570.9703287890934,13114,4238,28298,-24060,18249,6750,null,null,null,null,874,1055,null,null,null,null,null,null,null,null,null,null,null,null,null,null,null,null,null,"20,25",null,158,290,4991,null,1.3897849462365592,54.546411281835404,-2696.6539771588859,null,null,null,30.787004621201511,196.75415748347024,11.953643488410872,6007.8140653175715,13376,4410,28893,-24483,18797,6615,null,null,null,null,816,1182,null,null,null,null,null,null,null,null,null,null,null,null,null,null,null,null,null,"20,75",290,null,169,4991,null,null,null,null,null,null,null,null,null,null,null,13643,4619,29698,-25079,19466,6468,null,null,null,null,695,1150,null,null,null,null,null,null,null,null,null,null,null,null,null,null,null,null,null,"20,75",290,null,11285,11486,11659,11833,null,650,null,-4555,889,150,-2984,330,100,-2450,50,100,-2466,304,100,1500,1168,1000,-740,null,670,14372,10650,2743,0,15850,null,null,null,17480,9918,2784,0,18990,null,null,null,null,null,null,null,null,null,null,null,null,null,699,-699]
[19,"Aura",3962,null,0.44941634241245138,64.900000000000006,-2543,null,null,null,25.1,212,14,5500.3773584905666,7562,2860,21657,-18797,13725,5035,null,null,null,null,-183,634,null,null,null,null,null,null,null,null,null,null,null,null,null,null,null,null,null,21,172,null,280,3962,null,-1.1086309523809523,79.5,-3172,null,null,null,15,360,22,5883.4046839587008,7567,2813,22131,-19318,14065,5265,null,null,null,null,-91,621,null,null,null,null,null,null,null,null,null,null,null,null,null,null,null,null,null,21,null,311,172,3962,null,1.0578313253012048,71.18982405645049,-3249.8738011105502,null,null,null,15.995030250648227,304.13932357395259,19.422609847648488,5715.547703180212,7618,2852,22289,-19437,14920,5000,null,null,null,null,327,693,null,null,null,null,null,null,null,null,null,null,null,null,null,null,null,null,null,"21,75",173,null,201,3962,null,null,null,null,null,null,null,null,null,null,null,7704,2876,22392,-19516,15521,5000,null,null,null,null,849,821,null,null,null,null,null,null,null,null,null,null,null,null,null,null,null,null,null,"21,75",175,null,11693,11936,12052,12057,null,500,515,-2301,680,302,-1344,79,200,-1422,null,200,-1302,null,200,2500,-1750,null,3400,null,-60,15002,6566,4572,0,15485,null,null,null,16520,5123,8151,0,16905,null,null,null,null,null,null,null,null,null,null,null,null,null,607,-607]
[46,"Enonkoski",1522,null,6.9365079365079367,10.5,1526,null,null,null,88.9,1999,100,7266.9220945083016,4739,2219,11932,-9713,4449,5180,null,null,null,null,19,439,null,null,null,null,null,null,null,null,null,null,null,null,null,null,null,null,null,21,104,null,141,1522,null,null,11.3,1324,null,null,null,87.7,1985,97,7500.652741514361,4714,2286,11405,-9119,4528,5083,null,null,null,null,571,532,null,null,null,null,null,null,null,null,null,null,null,null,null,null,null,null,null,21,null,271,102,1522,null,6.8719999999999999,15.714408454334565,632.06307490144548,null,null,null,83.733403675371491,1687.910643889619,72.559390234465681,8490.8015768725363,4748,2286,11439,-9153,4468,5100,null,null,null,null,498,566,null,null,null,null,null,null,null,null,null,null,null,null,null,null,null,null,null,21,103,null,39,1522,null,null,null,null,null,null,null,null,null,null,null,4744,2286,11435,-9149,4557,5300,null,null,null,null,786,689,null,null,null,null,null,null,null,null,null,null,null,null,null,null,null,null,null,21,103,null,5368,4899,4899,4899,null,null,null,-496,null,null,-460,5,null,-486,50,null,-1321,225,null,null,null,null,null,800,80,680,0,0,665,0,null,null,null,0,680,80,631,760,null,null,null,null,null,null,null,null,null,null,null,null,null,63,-63]
[47,"Enontekiö",1891,null,0.83942307692307694,35.4,-2424,null,null,null,52.5,102,4,9041.7326994189116,7139,2359,16842,-14483,5580,8730,null,null,null,null,23,306,null,null,null,null,null,null,null,null,null,null,null,null,null,null,null,null,null,"20,75",160,null,83,1891,null,0.61633428300094972,35,-2528,null,null,null,52.4,254,9,9775.5319148936178,7557,2559,17146,-14587,5986,8715,null,null,null,null,347,329,null,null,null,null,null,null,null,null,null,null,null,null,null,null,null,null,null,"20,75",null,80,160,1891,null,0.24489795918367346,36.844958438742317,-2776.8376520359598,null,null,null,50.337129157926285,37.017451084082495,1.3848238482384825,9756.7424643046015,7557,2559,17146,-14587,5986,8715,null,null,null,null,347,300,null,null,null,null,null,null,null,null,null,null,null,null,null,null,null,null,null,"20,75",160,null,261,1891,null,null,null,null,null,null,null,null,null,null,null,7557,2559,17146,-14587,5986,8715,null,null,null,null,347,300,null,null,null,null,null,null,null,null,null,null,null,null,null,null,null,null,null,"20,75",160,null,7861,7722,7722,7722,null,null,null,-1440,150,100,-1231,122,null,-1000,null,null,-1000,null,null,1000,-42,1350,20,null,1063,4939,3093,873,1834,6159,null,null,null,6159,2739,1956,1834,6159,null,null,null,null,null,null,null,null,null,null,null,null,null,874,-874]
[49,"Espoo",260753,null,2.4490751739351775,23.9,1837,null,null,null,86.5,2435,134,6609.0936820380375,650643,786133,2086222,-1366834,1336653,31439,null,null,null,null,82189,114475,null,null,null,null,null,null,null,null,null,null,null,null,null,null,null,null,null,18,14160,null,26,260753,null,5.5008510953226759,24.2,1636,null,null,null,86.3,2425,133,6672.5539669189793,655812,867385,2191873,-1396307,1386045,5500,null,null,null,null,95496,119518,null,null,null,null,null,null,null,null,null,null,null,null,null,null,null,null,null,18,null,14,14160,260753,null,2.5564503828437206,33.707394695711095,1498.364352471496,null,null,null,81.626402070750643,3000.3068037568119,157.08736980155155,6971.3560342546389,662684,936001,2282168,-1425951,1432265,3500,null,null,null,null,108742,129941,null,null,null,null,null,null,null,null,null,null,null,null,null,null,null,null,null,18,14160,null,27,260753,null,null,null,null,null,null,null,null,null,null,null,667931,991808,2311199,-1397825,1485833,500,null,null,null,null,180491,137779,null,null,null,null,null,null,null,null,null,null,null,null,null,null,null,null,null,18,14160,null,963135,1008473,1063021,1078434,null,null,null,-273139,73539,30310,-325339,61158,50380,-282025,3311,54080,-271703,18295,65480,null,null,22556,5005,116000,93207,282146,134565,25144,286806,441411,null,null,null,628148,174505,164160,286656,722598,null,null,null,null,null,null,null,null,null,null,null,null,null,55179,-55179]
[50,"Eura",12368,null,2.9961904761904763,29.8,-1443,null,null,null,63,89,5,6315.2768834513845,35964,10976,77721,-66745,43084,23983,null,null,null,null,0,2900,null,null,null,null,null,null,null,null,null,null,null,null,null,null,null,null,null,"20,5",816,null,172,12368,null,2.0971690895179802,30,-1481,null,null,null,62.5,52,3,6287.3609543769144,37002,10859,76600,-65741,43218,24106,null,null,null,null,1286,3086,null,null,null,null,null,null,null,null,null,null,null,null,null,null,null,null,null,"20,5",null,111,816,12368,null,1.9146023468057367,37.489538687834447,-2006.8725743855111,null,null,null,56.260887537275977,44.388745148771022,2.2589790994972154,7172.2186287192753,37555,11083,78260,-67177,43993,23500,null,null,null,null,-24,3306,null,null,null,null,null,null,null,null,null,null,null,null,null,null,null,null,null,"20,5",816,null,187,12368,null,null,null,null,null,null,null,null,null,null,null,38031,11224,79912,-68688,44794,23300,null,null,null,null,-963,3106,null,null,null,null,null,null,null,null,null,null,null,null,null,null,null,null,null,"20,5",816,null,229436,28392,29297,30256,null,null,null,-8997,687,150,-6018,634,50,-3336,null,50,-1513,null,50,4043,null,296,1600,6400,-100,24639,5579,5600,3914,26377,null,null,null,29813,9465,7508,3730,32450,null,null,null,null,null,null,null,null,null,null,null,null,null,818,-818]
[51,"Eurajoki",5931,null,5.8562162162162164,33.1,2366,null,null,null,81,4160,191,7969.541409993155,17881,4597,42844,-38247,38581,9468,null,null,null,null,9641,1837,null,null,null,null,null,null,null,null,null,null,null,null,null,null,null,null,null,18,380,null,9,5931,null,9.244755244755245,27.7,1729,null,null,null,83.5,3320,146,8282.5059101654842,18799,4616,43633,-39017,39568,7395,null,null,null,null,7946,2202,null,null,null,null,null,null,null,null,null,null,null,null,null,null,null,null,null,18,null,2,380,5931,null,20.670648464163822,19.880825539639321,2310.5715730905413,null,null,null,87.323579398507349,3643.7363007924464,161.10483640374167,8255.2689259821273,null,null,null,null,null,null,null,null,null,null,null,null,null,null,null,null,null,null,null,null,null,null,null,null,null,null,null,null,null,18,380,null,1,5931,null,null,null,null,null,null,null,null,null,null,null,null,null,null,null,null,null,null,null,null,null,null,null,null,null,null,null,null,null,null,null,null,null,null,null,null,null,null,null,null,18,380,null,20496,20340,null,null,null,null,null,-7129,null,null,-3555,null,null,-4165,null,100,-9835,null,null,null,-81,null,null,null,null,3454,4310,702,226,3098,null,null,null,2742,3454,356,450,2386,null,null,null,null,null,null,null,null,null,null,null,null,null,701,-701]
[52,"Evijärvi",2685,null,2.376271186440678,26.8,-1370,null,null,null,62.4,208,12,6473.2435384055334,4232,1810,18478,-16668,8193,8200,null,null,null,null,-297,343,null,null,null,null,null,null,null,null,null,null,null,null,null,null,null,null,null,"21,5",71,null,45,2685,null,0.13082437275985664,27.4,-1498,null,null,null,60.5,163,9,6975.4281459419208,4185,1838,18344,-16506,8535,7860,null,null,null,null,-80,399,null,null,null,null,null,null,null,null,null,null,null,null,null,null,null,null,null,"21,5",null,236,74,2685,null,-0.19724770642201836,29.106982990152193,-1606.3314711359405,null,null,null,57.60276172125883,185.10242085661079,9.7137884872824642,6955.3072625698323,4352,1841,19011,-17170,9918,7703,null,null,null,null,465,465,null,null,null,null,null,null,null,null,null,null,null,null,null,null,null,null,null,26,71,null,287,2685,null,null,null,null,null,null,null,null,null,null,null,4396,1846,19273,-17427,10524,7395,null,null,null,null,490,490,null,null,null,null,null,null,null,null,null,null,null,null,null,null,null,null,null,"27,5",71,null,12715,12633,13059,13242,400,null,null,-2195,null,5170,-1012,null,null,-2659,null,null,-1595,null,null,null,-500,null,150,null,1100,4409,1098,2151,165,5495,null,null,null,7683,409,3193,228,8781,null,null,null,null,null,null,null,null,null,null,null,null,null,500,-500]
{"$rows_left_out":289}